Target
Intestinal-type alkaline phosphatase
Ligand
BDBM49612
Substrate
Meas. Tech.
Dose Response confirmation of uHTS hits from a small molecule inhibitors of human intestinal alkaline phosphatase via a luminescent assay
IC50
13000±n/a nM
Citation
 PubChem, PC Dose Response confirmation of uHTS hits from a small molecule inhibitors of human intestinal alkaline phosphatase via a luminescent assay PubChem Bioassay (2010)[AID] 
Target
Name:
Intestinal-type alkaline phosphatase
Synonyms:
ALPI Intestinal alkaline phosphatase | PPBI_HUMAN
Type:
PROTEIN
Mol. Mass.:
56804.94
Organism:
Homo sapiens (Human)
Description:
ChEMBL_1278525
Residue:
528
  
Inhibitor
Name:
BDBM49612
Synonyms:
4-[(1,5-dimethyl-4-nitro-3-pyrazolyl)azo]-N,N-diethylaniline 4-[(1,5-dimethyl-4-nitropyrazol-3-yl)diazenyl]-N,N-diethylaniline SMR000212742 [4-(1,5-dimethyl-4-nitro-pyrazol-3-yl)azophenyl]-diethyl-amine | cid_3776314
Type:
Small organic molecule
Emp. Form.:
C15H20N6O2
Mol. Mass.:
316.3583
SMILES:
CCN(CC)c1ccc(cc1)\N=N\c1nn(C)c(C)c1[N+]([O-])=O
: