Target
Intestinal-type alkaline phosphatase
Ligand
BDBM75744
Substrate
Meas. Tech.
Dose Response confirmation of uHTS hits from a small molecule inhibitors of human intestinal alkaline phosphatase via a luminescent assay
IC50
16100±n/a nM
Citation
 PubChem, PC Dose Response confirmation of uHTS hits from a small molecule inhibitors of human intestinal alkaline phosphatase via a luminescent assay PubChem Bioassay (2010)[AID] 
Target
Name:
Intestinal-type alkaline phosphatase
Synonyms:
ALPI Intestinal alkaline phosphatase | PPBI_HUMAN
Type:
PROTEIN
Mol. Mass.:
56804.94
Organism:
Homo sapiens (Human)
Description:
ChEMBL_1278525
Residue:
528
  
Inhibitor
Name:
BDBM75744
Synonyms:
(2E)-3-ethyl-2-[(1-ethyl-2-quinolin-1-iumyl)methylidene]-6-methyl-1,3-benzothiazole;iodide (2E)-3-ethyl-2-[(1-ethylquinolin-1-ium-2-yl)methylidene]-6-methyl-1,3-benzothiazole;iodide SMR000284410 | cid_16187754
Type:
Small organic molecule
Emp. Form.:
C22H23N2S
Mol. Mass.:
347.496
SMILES:
CCN1\C(Sc2cc(C)ccc12)=C/c1ccc2ccccc2[n+]1CC
: