Target
Intestinal-type alkaline phosphatase
Ligand
BDBM75646
Substrate
Meas. Tech.
Dose Response confirmation of uHTS hits from a small molecule inhibitors of human intestinal alkaline phosphatase via a luminescent assay
IC50
>100000±n/a nM
Citation
 PubChem, PC Dose Response confirmation of uHTS hits from a small molecule inhibitors of human intestinal alkaline phosphatase via a luminescent assay PubChem Bioassay (2010)[AID] 
Target
Name:
Intestinal-type alkaline phosphatase
Synonyms:
ALPI Intestinal alkaline phosphatase | PPBI_HUMAN
Type:
PROTEIN
Mol. Mass.:
56804.94
Organism:
Homo sapiens (Human)
Description:
ChEMBL_1278525
Residue:
528
  
Inhibitor
Name:
BDBM75646
Synonyms:
2-[4-[(1-ethyl-3-indolyl)methyl]-1-methyl-2-piperazinyl]ethanol 2-[4-[(1-ethylindol-3-yl)methyl]-1-methylpiperazin-2-yl]ethanol MLS001001524 cid_23723478
Type:
Small organic molecule
Emp. Form.:
C18H27N3O
Mol. Mass.:
301.4265
SMILES:
CCn1cc(CN2CCN(C)C(CCO)C2)c2ccccc12
: