Target
Intestinal-type alkaline phosphatase
Ligand
BDBM75651
Substrate
Meas. Tech.
Dose Response confirmation of uHTS hits from a small molecule inhibitors of human intestinal alkaline phosphatase via a luminescent assay
IC50
>100000±n/a nM
Citation
 PubChem, PC Dose Response confirmation of uHTS hits from a small molecule inhibitors of human intestinal alkaline phosphatase via a luminescent assay PubChem Bioassay (2010)[AID] 
Target
Name:
Intestinal-type alkaline phosphatase
Synonyms:
ALPI Intestinal alkaline phosphatase | PPBI_HUMAN
Type:
PROTEIN
Mol. Mass.:
56804.94
Organism:
Homo sapiens (Human)
Description:
ChEMBL_1278525
Residue:
528
  
Inhibitor
Name:
BDBM75651
Synonyms:
1-Isopropyl-5-oxo-pyrrolidine-3-carboxylic acid (4-acetylamino-phenyl)-amide N-(4-acetamidophenyl)-1-isopropyl-5-keto-pyrrolidine-3-carboxamide N-(4-acetamidophenyl)-5-oxo-1-propan-2-yl-3-pyrrolidinecarboxamide SMR000524143 | cid_3156931
Type:
Small organic molecule
Emp. Form.:
C16H21N3O3
Mol. Mass.:
303.3562
SMILES:
CC(C)N1CC(CC1=O)C(=O)Nc1ccc(NC(C)=O)cc1
: