Target
Intestinal-type alkaline phosphatase
Ligand
BDBM75652
Substrate
Meas. Tech.
Dose Response confirmation of uHTS hits from a small molecule inhibitors of human intestinal alkaline phosphatase via a luminescent assay
IC50
>100000±n/a nM
Citation
 PubChem, PC Dose Response confirmation of uHTS hits from a small molecule inhibitors of human intestinal alkaline phosphatase via a luminescent assay PubChem Bioassay (2010)[AID] 
Target
Name:
Intestinal-type alkaline phosphatase
Synonyms:
ALPI Intestinal alkaline phosphatase | PPBI_HUMAN
Type:
PROTEIN
Mol. Mass.:
56804.94
Organism:
Homo sapiens (Human)
Description:
ChEMBL_1278525
Residue:
528
  
Inhibitor
Name:
BDBM75652
Synonyms:
2-(4-Fluoro-benzoylamino)-5,6-dihydro-4H-cyclopenta[b]thiophene-3-carboxylic acid amide 2-[(4-fluorophenyl)carbonylamino]-5,6-dihydro-4H-cyclopenta[b]thiophene-3-carboxamide MLS001201422 cid_675164
Type:
Small organic molecule
Emp. Form.:
C15H13FN2O2S
Mol. Mass.:
304.339
SMILES:
NC(=O)c1c(NC(=O)c2ccc(F)cc2)sc2CCCc12
: