Target
Furin
Ligand
BDBM60407
Substrate
Meas. Tech.
High throughput fluorescence intensity-based biochemical assay to screen for small molecule inhibitors of Furin:Concentration-response Confirmation Assays
IC50
>50000±n/a nM
Citation
 PubChem, PC High throughput fluorescence intensity-based biochemical assay to screen for small molecule inhibitors of Furin:Concentration-response Confirmation Assays PubChem Bioassay (2010)[AID] 
Target
Name:
Furin
Synonyms:
FUR FURIN_HUMAN PACE | PCSK3
Type:
Enzyme Catalytic Domain
Mol. Mass.:
86676.01
Organism:
Homo sapiens (Human)
Description:
P09958
Residue:
794
  
Inhibitor
Name:
BDBM60407
Synonyms:
(5Z)-5-[[4-(dimethylamino)anilino]methylene]-1-(o-tolyl)barbituric acid (5Z)-5-[[[4-(dimethylamino)phenyl]amino]methylidene]-1-(2-methylphenyl)-1,3-diazinane-2,4,6-trione SMR000102641 | cid_5310822
Type:
Small organic molecule
Emp. Form.:
C20H20N4O3
Mol. Mass.:
364.3978
SMILES:
CN(C)c1ccc(cc1)N=Cc1c(O)n(-c2ccccc2C)c(=O)[nH]c1=O
: