Target
Type-1 angiotensin II receptor
Ligand
BDBM67305
Substrate
Meas. Tech.
Dose Response screen for antagonists of Angiotensin II Receptor Type 1 to assess selectivity of uHTS small molecule antagonists hits of the APJ receptor
IC50
3681±343 nM
Citation
 PubChem, PC Dose Response screen for antagonists of Angiotensin II Receptor Type 1 to assess selectivity of uHTS small molecule antagonists hits of the APJ receptor PubChem Bioassay (2010)[AID] 
Target
Name:
Type-1 angiotensin II receptor
Synonyms:
AGTR1 AGTR1B AT1 AT1BR AT2R1B Angiotensin II receptor Type-1 angiotensin II receptor (AT1)
Type:
Protein
Mol. Mass.:
41080.75
Organism:
Homo sapiens (Human)
Description:
P30556
Residue:
359
  
Inhibitor
Name:
BDBM67305
Synonyms:
3,5-dimethyl-N'-(4-propan-2-ylphenyl)-1,2-oxazole-4-carbohydrazide 3,5-dimethyl-N'-p-cumenyl-isoxazole-4-carbohydrazide N'-(4-isopropylphenyl)-3,5-dimethyl-4-isoxazolecarbohydrazide cid_2811457
Type:
Small organic molecule
Emp. Form.:
C15H19N3O2
Mol. Mass.:
273.3303
SMILES:
CC(C)c1ccc(NNC(=O)c2c(C)noc2C)cc1
: