Target
G-protein coupled receptor 35
Ligand
BDBM58651
Substrate
Meas. Tech.
SAR Analysis for the identification of Selective Antagonists of ERK1/2 Activity in GPR35-Overexpressing U2OS Cells
IC50
635.7±274 nM
Citation
 PubChem, PC SAR Analysis for the identification of Selective Antagonists of ERK1/2 Activity in GPR35-Overexpressing U2OS Cells PubChem Bioassay (2010)[AID] 
Target
Name:
G-protein coupled receptor 35
Synonyms:
G protein-coupled receptor 35 GPR35_HUMAN
Type:
Enzyme Catalytic Domain
Mol. Mass.:
34085.57
Organism:
Homo sapiens (Human)
Description:
gi_33695097
Residue:
309
  
Inhibitor
Name:
BDBM58651
Synonyms:
4-[4-[(5Z)-5-(4-ethylbenzylidene)-4-keto-2-thioxo-thiazolidin-3-yl]butanoylamino]benzoic acid 4-[4-[(5Z)-5-[(4-ethylphenyl)methylidene]-4-oxo-2-sulfanylidene-1,3-thiazolidin-3-yl]butanoylamino]benzoic acid MLS001075748 cid_1985027
Type:
Small organic molecule
Emp. Form.:
C23H22N2O4S2
Mol. Mass.:
454.562
SMILES:
CCc1ccc(\C=C2/SC(=S)N(CCCC(=O)Nc3ccc(cc3)C(O)=O)C2=O)cc1
: