Target
Insulin-degrading enzyme
Ligand
BDBM75792
Substrate
Meas. Tech.
Dose Response: Fluorescence polarization-based cell-based high throughput dose response assay for inhibitors of insulin-degrading enzyme (IDE)
IC50
4000±n/a nM
Citation
 PubChem, PC Dose Response: Fluorescence polarization-based cell-based high throughput dose response assay for inhibitors of insulin-degrading enzyme (IDE) PubChem Bioassay (2010)[AID] 
Target
Name:
Insulin-degrading enzyme
Synonyms:
Abeta-degrading protease IDE Insulin degrading enzyme (hIDE) Insulin-degrading enzyme Insulysin | insulin-degrading enzyme isoform 1 precursor
Type:
Enzyme Catalytic Domain
Mol. Mass.:
117968.59
Organism:
Homo sapiens (Human)
Description:
P14735
Residue:
1019
  
Inhibitor
Name:
BDBM75792
Synonyms:
2-[3-[4-(2,3-dimethylphenyl)piperazin-1-yl]carbonylphenyl]-4-methyl-3a,4,7,7a-tetrahydroisoindole-1,3-dione 2-[3-[4-(2,3-dimethylphenyl)piperazine-1-carbonyl]phenyl]-4-methyl-3a,4,7,7a-tetrahydroisoindole-1,3-quinone MLS000520925 cid_4321479
Type:
Small organic molecule
Emp. Form.:
C28H31N3O3
Mol. Mass.:
457.564
SMILES:
CC1C=CCc2c(O)n(c(O)c12)-c1cccc(c1)C(=O)N1CCN(CC1)c1cccc(C)c1C
: