Target
Insulin-degrading enzyme
Ligand
BDBM75811
Substrate
Meas. Tech.
Dose Response: Fluorescence polarization-based cell-based high throughput dose response assay for inhibitors of insulin-degrading enzyme (IDE)
IC50
>55941±n/a nM
Citation
 PubChem, PC Dose Response: Fluorescence polarization-based cell-based high throughput dose response assay for inhibitors of insulin-degrading enzyme (IDE) PubChem Bioassay (2010)[AID] 
Target
Name:
Insulin-degrading enzyme
Synonyms:
Abeta-degrading protease IDE Insulin degrading enzyme (hIDE) Insulin-degrading enzyme Insulysin | insulin-degrading enzyme isoform 1 precursor
Type:
Enzyme Catalytic Domain
Mol. Mass.:
117968.59
Organism:
Homo sapiens (Human)
Description:
P14735
Residue:
1019
  
Inhibitor
Name:
BDBM75811
Synonyms:
MLS000702066 N-(3,4-dimethylphenyl)-2-[[4-methyl-5-(morpholin-4-ylmethyl)-1,2,4-triazol-3-yl]sulfanyl]acetamide N-(3,4-dimethylphenyl)-2-[[4-methyl-5-(morpholinomethyl)-1,2,4-triazol-3-yl]thio]acetamide SMR000226573 | cid_1211193
Type:
Small organic molecule
Emp. Form.:
C18H25N5O2S
Mol. Mass.:
375.488
SMILES:
Cc1ccc(NC(=O)CSc2nnc(CN3CCOCC3)n2C)cc1C
: