Target
Insulin-degrading enzyme
Ligand
BDBM61694
Substrate
Meas. Tech.
Dose Response: Fluorescence polarization-based cell-based high throughput dose response assay for inhibitors of insulin-degrading enzyme (IDE)
IC50
4536±n/a nM
Citation
 PubChem, PC Dose Response: Fluorescence polarization-based cell-based high throughput dose response assay for inhibitors of insulin-degrading enzyme (IDE) PubChem Bioassay (2010)[AID] 
Target
Name:
Insulin-degrading enzyme
Synonyms:
Abeta-degrading protease IDE Insulin degrading enzyme (hIDE) Insulin-degrading enzyme Insulysin | insulin-degrading enzyme isoform 1 precursor
Type:
Enzyme Catalytic Domain
Mol. Mass.:
117968.59
Organism:
Homo sapiens (Human)
Description:
P14735
Residue:
1019
  
Inhibitor
Name:
BDBM61694
Synonyms:
MLS000689389 N-(4-bromo-3-methyl-phenyl)-2-(3-keto-4,6-dimethyl-isothiazolo[5,4-b]pyridin-2-yl)acetamide N-(4-bromo-3-methylphenyl)-2-(4,6-dimethyl-3-oxo-[1,2]thiazolo[5,4-b]pyridin-2-yl)acetamide SMR000311188 | cid_4247465
Type:
Small organic molecule
Emp. Form.:
C17H16BrN3O2S
Mol. Mass.:
406.297
SMILES:
Cc1cc(C)c2c(n1)sn(CC(=O)Nc1ccc(Br)c(C)c1)c2=O
: