Target
Insulin-degrading enzyme
Ligand
BDBM75828
Substrate
Meas. Tech.
Dose Response: Fluorescence polarization-based cell-based high throughput dose response assay for inhibitors of insulin-degrading enzyme (IDE)
IC50
>55941±n/a nM
Citation
 PubChem, PC Dose Response: Fluorescence polarization-based cell-based high throughput dose response assay for inhibitors of insulin-degrading enzyme (IDE) PubChem Bioassay (2010)[AID] 
Target
Name:
Insulin-degrading enzyme
Synonyms:
Abeta-degrading protease IDE Insulin degrading enzyme (hIDE) Insulin-degrading enzyme Insulysin | insulin-degrading enzyme isoform 1 precursor
Type:
Enzyme Catalytic Domain
Mol. Mass.:
117968.59
Organism:
Homo sapiens (Human)
Description:
P14735
Residue:
1019
  
Inhibitor
Name:
BDBM75828
Synonyms:
MLS000516892 N-(tert-butylcarbamoyl)-2-[4-(3-chlorophenyl)piperazin-1-yl]ethanamide N-[(tert-butylamino)-oxomethyl]-2-[4-(3-chlorophenyl)-1-piperazinyl]acetamide cid_2089384
Type:
Small organic molecule
Emp. Form.:
C17H25ClN4O2
Mol. Mass.:
352.859
SMILES:
CC(C)(C)NC(=O)NC(=O)CN1CCN(CC1)c1cccc(Cl)c1
: