Target
Insulin-degrading enzyme
Ligand
BDBM75836
Substrate
Meas. Tech.
Dose Response: Fluorescence polarization-based cell-based high throughput dose response assay for inhibitors of insulin-degrading enzyme (IDE)
IC50
17749±n/a nM
Citation
 PubChem, PC Dose Response: Fluorescence polarization-based cell-based high throughput dose response assay for inhibitors of insulin-degrading enzyme (IDE) PubChem Bioassay (2010)[AID] 
Target
Name:
Insulin-degrading enzyme
Synonyms:
Abeta-degrading protease IDE Insulin degrading enzyme (hIDE) Insulin-degrading enzyme Insulysin | insulin-degrading enzyme isoform 1 precursor
Type:
Enzyme Catalytic Domain
Mol. Mass.:
117968.59
Organism:
Homo sapiens (Human)
Description:
P14735
Residue:
1019
  
Inhibitor
Name:
BDBM75836
Synonyms:
(5Z)-5-(4,5-dimethyl-6-oxidanylidene-cyclohexa-2,4-dien-1-ylidene)-N-[4-(pyrimidin-2-ylsulfamoyl)phenyl]-1,2-dihydropyrazole-3-carboxamide (5Z)-5-(4,5-dimethyl-6-oxocyclohexa-2,4-dien-1-ylidene)-N-[4-(pyrimidin-2-ylsulfamoyl)phenyl]-1,2-dihydropyrazole-3-carboxamide 5-(2-Hydroxy-3,4-dimethyl-phenyl)-2H-pyrazole-3-carboxylic acid [4-(pyrimidin-2-ylsulfamoyl)-phenyl]-amide SMR000415929 | cid_16446044
Type:
Small organic molecule
Emp. Form.:
C22H20N6O4S
Mol. Mass.:
464.497
SMILES:
Cc1ccc(-c2cc([nH]n2)C(=O)Nc2ccc(cc2)S(=O)(=O)Nc2ncccn2)c(O)c1C
: