Target
Insulin-degrading enzyme
Ligand
BDBM75842
Substrate
Meas. Tech.
Dose Response: Fluorescence polarization-based cell-based high throughput dose response assay for inhibitors of insulin-degrading enzyme (IDE)
IC50
>55900±n/a nM
Citation
 PubChem, PC Dose Response: Fluorescence polarization-based cell-based high throughput dose response assay for inhibitors of insulin-degrading enzyme (IDE) PubChem Bioassay (2010)[AID] 
Target
Name:
Insulin-degrading enzyme
Synonyms:
Abeta-degrading protease IDE Insulin degrading enzyme (hIDE) Insulin-degrading enzyme Insulysin | insulin-degrading enzyme isoform 1 precursor
Type:
Enzyme Catalytic Domain
Mol. Mass.:
117968.59
Organism:
Homo sapiens (Human)
Description:
P14735
Residue:
1019
  
Inhibitor
Name:
BDBM75842
Synonyms:
1-benzyl-5-[3-(tert-butylamino)-2-hydroxy-propoxy]-2-methyl-indole-3-carboxylic acid ethyl ester MLS001196476 cid_2921884 ethyl 1-benzyl-5-[3-(tert-butylamino)-2-hydroxypropoxy]-2-methylindole-3-carboxylate | ethyl 5-[3-(tert-butylamino)-2-oxidanyl-propoxy]-2-methyl-1-(phenylmethyl)indole-3-carboxylate
Type:
Small organic molecule
Emp. Form.:
C26H34N2O4
Mol. Mass.:
438.5592
SMILES:
CCOC(=O)c1c(C)n(Cc2ccccc2)c2ccc(OCC(O)CNC(C)(C)C)cc12
: