Target
Insulin-degrading enzyme
Ligand
BDBM75855
Substrate
Meas. Tech.
Dose Response: Fluorescence polarization-based cell-based high throughput dose response assay for inhibitors of insulin-degrading enzyme (IDE)
IC50
>55928±n/a nM
Citation
 PubChem, PC Dose Response: Fluorescence polarization-based cell-based high throughput dose response assay for inhibitors of insulin-degrading enzyme (IDE) PubChem Bioassay (2010)[AID] 
Target
Name:
Insulin-degrading enzyme
Synonyms:
Abeta-degrading protease IDE Insulin degrading enzyme (hIDE) Insulin-degrading enzyme Insulysin | insulin-degrading enzyme isoform 1 precursor
Type:
Enzyme Catalytic Domain
Mol. Mass.:
117968.59
Organism:
Homo sapiens (Human)
Description:
P14735
Residue:
1019
  
Inhibitor
Name:
BDBM75855
Synonyms:
MLS002472284 N-cyclopropyl-6-(4-methylpiperidin-1-yl)-9,10,10-trioxothioxanthene-1-carboxamide N-cyclopropyl-9,10,10-triketo-6-(4-methylpiperidino)thioxanthene-1-carboxamide cid_44144203
Type:
Small organic molecule
Emp. Form.:
C23H24N2O4S
Mol. Mass.:
424.513
SMILES:
CC1CCN(CC1)c1ccc2C(=O)c3c(cccc3S(=O)(=O)c2c1)C(=O)NC1CC1
: