Target
G-protein coupled receptor 55
Ligand
BDBM75858
Substrate
Meas. Tech.
SAR Analysis of Selective Antagonists of GPR55 using an Image-Based Assay - Set 3
IC50
16400±n/a nM
Citation
 PubChem, PC SAR Analysis of Selective Antagonists of GPR55 using an Image-Based Assay - Set 3 PubChem Bioassay (2010)[AID] 
Target
Name:
G-protein coupled receptor 55
Synonyms:
G protein-coupled receptor 55 GPR55_HUMAN
Type:
PROTEIN
Mol. Mass.:
36649.72
Organism:
Homo sapiens (Human)
Description:
ChEMBL_1292265
Residue:
319
  
Inhibitor
Name:
BDBM75858
Synonyms:
1-tert-butyl-3-[[(E)-[3-(4-methoxyphenyl)-4-pyrazolylidene]methyl]amino]thiourea MLS-0437441.0001 | cid_5703674
Type:
Small organic molecule
Emp. Form.:
C16H21N5OS
Mol. Mass.:
331.436
SMILES:
COc1ccc(cc1)-c1n[nH]cc1C=NNC(=S)NC(C)(C)C
: