Target
Melanin-concentrating hormone receptor 1
Ligand
BDBM75886
Substrate
Meas. Tech.
Late-stage fluorescence-based counterscreen for antagonists of the G-protein coupled receptor 7 (GPR7)
IC50
5000±n/a nM
Citation
 PubChem, PC Late-stage fluorescence-based counterscreen for antagonists of the G-protein coupled receptor 7 (GPR7): cell-based dose response assay to identify antagonists of the melanin-concentrating hormone receptor 1 (MCHR1) PubChem Bioassay (2010)[AID] 
Target
Name:
Melanin-concentrating hormone receptor 1
Synonyms:
G-protein coupled receptor 24 MCH receptor 1 MCH-R1 MCHR-1 MCHR1_HUMAN Melanin-Concentrating Hormone Receptor 1 (MCH1R) Melanin-concentrating hormone receptor 1 (MCH-1) Melanin-concentrating hormone receptor 1 (MCHR-1) SLC-1 Somatostatin receptor-like protein
Type:
G Protein-Coupled Receptor (GPCR)
Mol. Mass.:
45976.27
Organism:
Homo sapiens (Human)
Description:
Membranes from CHO-K1 cells stably expressing human MCH1R were used in assays.
Residue:
422
  
Inhibitor
Name:
BDBM75886
Synonyms:
5-chloranyl-4-(4-ethylphenoxy)-2-(4-methylphenyl)pyridazin-3-one 5-chloro-4-(4-ethylphenoxy)-2-(4-methylphenyl)pyridazin-3-one SR-02000000354 cid_46172920
Type:
Small organic molecule
Emp. Form.:
C19H17ClN2O2
Mol. Mass.:
340.803
SMILES:
CCc1ccc(Oc2c(Cl)cnn(-c3ccc(C)cc3)c2=O)cc1
: