Target
Melanin-concentrating hormone receptor 1
Ligand
BDBM75942
Substrate
Meas. Tech.
Late-stage fluorescence-based counterscreen for antagonists of the G-protein coupled receptor 7 (GPR7)
IC50
2600±n/a nM
Citation
 PubChem, PC Late-stage fluorescence-based counterscreen for antagonists of the G-protein coupled receptor 7 (GPR7): cell-based dose response assay to identify antagonists of the melanin-concentrating hormone receptor 1 (MCHR1) PubChem Bioassay (2010)[AID] 
Target
Name:
Melanin-concentrating hormone receptor 1
Synonyms:
G-protein coupled receptor 24 MCH receptor 1 MCH-R1 MCHR-1 MCHR1_HUMAN Melanin-Concentrating Hormone Receptor 1 (MCH1R) Melanin-concentrating hormone receptor 1 (MCH-1) Melanin-concentrating hormone receptor 1 (MCHR-1) SLC-1 Somatostatin receptor-like protein
Type:
G Protein-Coupled Receptor (GPCR)
Mol. Mass.:
45976.27
Organism:
Homo sapiens (Human)
Description:
Membranes from CHO-K1 cells stably expressing human MCH1R were used in assays.
Residue:
422
  
Inhibitor
Name:
BDBM75942
Synonyms:
5-chloranyl-4-(4-methoxyphenoxy)-2-[3-(trifluoromethyl)phenyl]pyridazin-3-one 5-chloro-4-(4-methoxyphenoxy)-2-[3-(trifluoromethyl)phenyl]pyridazin-3-one SR-02000000478-1 | cid_46850889
Type:
Small organic molecule
Emp. Form.:
C18H12ClF3N2O3
Mol. Mass.:
396.748
SMILES:
COc1ccc(Oc2c(Cl)cnn(-c3cccc(c3)C(F)(F)F)c2=O)cc1
: