Target
Neuropeptides B/W receptor type 1
Ligand
BDBM75872
Substrate
Meas. Tech.
Late-stage fluorescence-based dose response cell-based screening assay to identify antagonists of the G-protein coupled receptor 7 (GPR7)
IC50
18200±n/a nM
Citation
 PubChem, PC Late-stage fluorescence-based dose response cell-based screening assay to identify antagonists of the G-protein coupled receptor 7 (GPR7) PubChem Bioassay (2010)[AID] 
Target
Name:
Neuropeptides B/W receptor type 1
Synonyms:
GPR7 NPBWR1 | neuropeptides B/W receptor 1
Type:
Enzyme Catalytic Domain
Mol. Mass.:
36111.82
Organism:
Homo sapiens (Human)
Description:
gi_119607128
Residue:
328
  
Inhibitor
Name:
BDBM75872
Synonyms:
5-chloranyl-2-(4-methylphenyl)-4-phenoxy-pyridazin-3-one 5-chloro-2-(4-methylphenyl)-4-phenoxypyridazin-3-one SR-02000000337 cid_45382325
Type:
Small organic molecule
Emp. Form.:
C17H13ClN2O2
Mol. Mass.:
312.75
SMILES:
Cc1ccc(cc1)-n1ncc(Cl)c(Oc2ccccc2)c1=O
: