Target
Neuropeptides B/W receptor type 1
Ligand
BDBM75954
Substrate
Meas. Tech.
Late-stage fluorescence-based dose response cell-based screening assay to identify antagonists of the G-protein coupled receptor 7 (GPR7)
IC50
>20000±n/a nM
Citation
 PubChem, PC Late-stage fluorescence-based dose response cell-based screening assay to identify antagonists of the G-protein coupled receptor 7 (GPR7) PubChem Bioassay (2010)[AID] 
Target
Name:
Neuropeptides B/W receptor type 1
Synonyms:
GPR7 NPBWR1 | neuropeptides B/W receptor 1
Type:
Enzyme Catalytic Domain
Mol. Mass.:
36111.82
Organism:
Homo sapiens (Human)
Description:
gi_119607128
Residue:
328
  
Inhibitor
Name:
BDBM75954
Synonyms:
4-(4-methoxyphenoxy)-5-methyl-2-phenyl-3-pyridazinone 4-(4-methoxyphenoxy)-5-methyl-2-phenylpyridazin-3-one SR-02000000344-1 | cid_45382323
Type:
Small organic molecule
Emp. Form.:
C18H16N2O3
Mol. Mass.:
308.3312
SMILES:
COc1ccc(Oc2c(C)cnn(-c3ccccc3)c2=O)cc1
: