Target
Neuropeptides B/W receptor type 1
Ligand
BDBM62060
Substrate
Meas. Tech.
Late-stage fluorescence-based dose response cell-based screening assay to identify antagonists of the G-protein coupled receptor 7 (GPR7)
IC50
>20000±n/a nM
Citation
 PubChem, PC Late-stage fluorescence-based dose response cell-based screening assay to identify antagonists of the G-protein coupled receptor 7 (GPR7) PubChem Bioassay (2010)[AID] 
Target
Name:
Neuropeptides B/W receptor type 1
Synonyms:
GPR7 NPBWR1 | neuropeptides B/W receptor 1
Type:
Enzyme Catalytic Domain
Mol. Mass.:
36111.82
Organism:
Homo sapiens (Human)
Description:
gi_119607128
Residue:
328
  
Inhibitor
Name:
BDBM62060
Synonyms:
2-[[4-(2-methoxyphenyl)-5-(4-piperidin-1-ylsulfonylphenyl)-1,2,4-triazol-3-yl]sulfanyl]acetamide 2-[[4-(2-methoxyphenyl)-5-(4-piperidinosulfonylphenyl)-1,2,4-triazol-3-yl]thio]acetamide 2-{4-(2-Methoxy-phenyl)-5-[4-(piperidine-1-sulfonyl)-phenyl]-4H-[1,2,4]triazol-3-ylsulfanyl}-acetamide SMR000002779 | cid_647363
Type:
Small organic molecule
Emp. Form.:
C22H25N5O4S2
Mol. Mass.:
487.595
SMILES:
COc1ccccc1-n1c(SCC(N)=O)nnc1-c1ccc(cc1)S(=O)(=O)N1CCCCC1
: