Target
Photoreceptor-specific nuclear receptor
Ligand
BDBM40183
Substrate
Meas. Tech.
TR-FRET-based biochemical high throughput dose response assay to identify NR2E3 inverse agonists
IC50
2695±n/a nM
Citation
 PubChem, PC TR-FRET-based biochemical high throughput dose response assay to identify NR2E3 inverse agonists PubChem Bioassay (2010)[AID] 
Target
Name:
Photoreceptor-specific nuclear receptor
Synonyms:
NR2E3 PNR photoreceptor-specific nuclear receptor
Type:
PROTEIN
Mol. Mass.:
44699.83
Organism:
Homo sapiens (Human)
Description:
ChEMBL_401901
Residue:
410
  
Inhibitor
Name:
BDBM40183
Synonyms:
(4-fluorobenzyl)-([1,2,4]triazolo[4,3-a]quinoxalin-4-yl)amine N-[(4-fluorophenyl)methyl]-[1,2,4]triazolo[4,3-a]quinoxalin-4-amine cid_5295768
Type:
Small organic molecule
Emp. Form.:
C16H12FN5
Mol. Mass.:
293.2984
SMILES:
Fc1ccc(CNc2nc3ccccc3n3cnnc23)cc1
: