Target
Photoreceptor-specific nuclear receptor
Ligand
BDBM75976
Substrate
Meas. Tech.
TR-FRET-based biochemical high throughput dose response assay to identify NR2E3 inverse agonists
IC50
5922±n/a nM
Citation
 PubChem, PC TR-FRET-based biochemical high throughput dose response assay to identify NR2E3 inverse agonists PubChem Bioassay (2010)[AID] 
Target
Name:
Photoreceptor-specific nuclear receptor
Synonyms:
NR2E3 PNR photoreceptor-specific nuclear receptor
Type:
PROTEIN
Mol. Mass.:
44699.83
Organism:
Homo sapiens (Human)
Description:
ChEMBL_401901
Residue:
410
  
Inhibitor
Name:
BDBM75976
Synonyms:
3-(4-methoxyphenyl)-2-[4-methoxy-3-(pyridin-2-ylsulfanylmethyl)phenyl]-1,2-dihydroquinazolin-4-one 3-(4-methoxyphenyl)-2-[4-methoxy-3-[(2-pyridylthio)methyl]phenyl]-1,2-dihydroquinazolin-4-one MLS000572432 cid_2888544
Type:
Small organic molecule
Emp. Form.:
C28H25N3O3S
Mol. Mass.:
483.581
SMILES:
COc1ccc(cc1)N1C(Nc2ccccc2C1=O)c1ccc(OC)c(CSc2ccccn2)c1
: