Target
Photoreceptor-specific nuclear receptor
Ligand
BDBM76003
Substrate
Meas. Tech.
TR-FRET-based biochemical high throughput dose response assay to identify NR2E3 inverse agonists
IC50
7542±n/a nM
Citation
 PubChem, PC TR-FRET-based biochemical high throughput dose response assay to identify NR2E3 inverse agonists PubChem Bioassay (2010)[AID] 
Target
Name:
Photoreceptor-specific nuclear receptor
Synonyms:
NR2E3 PNR photoreceptor-specific nuclear receptor
Type:
PROTEIN
Mol. Mass.:
44699.83
Organism:
Homo sapiens (Human)
Description:
ChEMBL_401901
Residue:
410
  
Inhibitor
Name:
BDBM76003
Synonyms:
6-methyl-4-(1-piperidinylmethyl)-1-benzopyran-2-one 6-methyl-4-(piperidinomethyl)coumarin SMR000544274 | cid_1779738
Type:
Small organic molecule
Emp. Form.:
C16H19NO2
Mol. Mass.:
257.3276
SMILES:
Cc1ccc2oc(=O)cc(CN3CCCCC3)c2c1
: