Target
Photoreceptor-specific nuclear receptor
Ligand
BDBM76012
Substrate
Meas. Tech.
TR-FRET-based biochemical high throughput dose response assay to identify NR2E3 inverse agonists
IC50
5353±n/a nM
Citation
 PubChem, PC TR-FRET-based biochemical high throughput dose response assay to identify NR2E3 inverse agonists PubChem Bioassay (2010)[AID] 
Target
Name:
Photoreceptor-specific nuclear receptor
Synonyms:
NR2E3 PNR photoreceptor-specific nuclear receptor
Type:
PROTEIN
Mol. Mass.:
44699.83
Organism:
Homo sapiens (Human)
Description:
ChEMBL_401901
Residue:
410
  
Inhibitor
Name:
BDBM76012
Synonyms:
2-(2-Cyclopropyl-quinazolin-4-ylsulfanyl)-N-(3,5-dimethoxy-phenyl)-acetamide 2-(2-cyclopropylquinazolin-4-yl)sulfanyl-N-(3,5-dimethoxyphenyl)ethanamide 2-[(2-cyclopropylquinazolin-4-yl)thio]-N-(3,5-dimethoxyphenyl)acetamide SMR000600258 | cid_1435125
Type:
Small organic molecule
Emp. Form.:
C21H21N3O3S
Mol. Mass.:
395.475
SMILES:
COc1cc(NC(=O)CSc2nc(nc3ccccc23)C2CC2)cc(OC)c1
: