Target
Isoform 2 of Nuclear receptor corepressor 2 (TRAC-1)
Ligand
BDBM75965
Substrate
Meas. Tech.
Counterscreen for NR2E3 inverse agonists
IC50
2002±n/a nM
Citation
 PubChem, PC Counterscreen for NR2E3 inverse agonists: TR-FRET-based biochemical high throughput dose response assay to identify inverse agonists of the interaction between peroxisome proliferator-activated receptor gamma (PPARg) and nuclear receptor co-repressor 2 (NCOR2) PubChem Bioassay (2010)[AID] 
Target
Name:
Isoform 2 of Nuclear receptor corepressor 2 (TRAC-1)
Synonyms:
CTG26 NCOR2_HUMAN nuclear receptor corepressor 2 isoform 2
Type:
Enzyme Catalytic Domain
Mol. Mass.:
81401.89
Organism:
Homo sapiens (Human)
Description:
Q9Y618-2 gi_116256445
Residue:
766
  
Inhibitor
Name:
BDBM75965
Synonyms:
MLS000050497 N-[4-(5-methyl-1,3-benzoxazol-2-yl)phenyl]-piperonylamide cid_1294813
Type:
Small organic molecule
Emp. Form.:
C22H16N2O4
Mol. Mass.:
372.3734
SMILES:
Cc1ccc2oc(nc2c1)-c1ccc(NC(=O)c2ccc3OCOc3c2)cc1
: