Target
Isoform 2 of Nuclear receptor corepressor 2 (TRAC-1)
Ligand
BDBM40183
Substrate
Meas. Tech.
Counterscreen for NR2E3 inverse agonists
IC50
1422±n/a nM
Citation
 PubChem, PC Counterscreen for NR2E3 inverse agonists: TR-FRET-based biochemical high throughput dose response assay to identify inverse agonists of the interaction between peroxisome proliferator-activated receptor gamma (PPARg) and nuclear receptor co-repressor 2 (NCOR2) PubChem Bioassay (2010)[AID] 
Target
Name:
Isoform 2 of Nuclear receptor corepressor 2 (TRAC-1)
Synonyms:
CTG26 NCOR2_HUMAN nuclear receptor corepressor 2 isoform 2
Type:
Enzyme Catalytic Domain
Mol. Mass.:
81401.89
Organism:
Homo sapiens (Human)
Description:
Q9Y618-2 gi_116256445
Residue:
766
  
Inhibitor
Name:
BDBM40183
Synonyms:
(4-fluorobenzyl)-([1,2,4]triazolo[4,3-a]quinoxalin-4-yl)amine N-[(4-fluorophenyl)methyl]-[1,2,4]triazolo[4,3-a]quinoxalin-4-amine cid_5295768
Type:
Small organic molecule
Emp. Form.:
C16H12FN5
Mol. Mass.:
293.2984
SMILES:
Fc1ccc(CNc2nc3ccccc3n3cnnc23)cc1
: