Target
Isoform 2 of Nuclear receptor corepressor 2 (TRAC-1)
Ligand
BDBM57344
Substrate
Meas. Tech.
Counterscreen for NR2E3 inverse agonists
IC50
14527±n/a nM
Citation
 PubChem, PC Counterscreen for NR2E3 inverse agonists: TR-FRET-based biochemical high throughput dose response assay to identify inverse agonists of the interaction between peroxisome proliferator-activated receptor gamma (PPARg) and nuclear receptor co-repressor 2 (NCOR2) PubChem Bioassay (2010)[AID] 
Target
Name:
Isoform 2 of Nuclear receptor corepressor 2 (TRAC-1)
Synonyms:
CTG26 NCOR2_HUMAN nuclear receptor corepressor 2 isoform 2
Type:
Enzyme Catalytic Domain
Mol. Mass.:
81401.89
Organism:
Homo sapiens (Human)
Description:
Q9Y618-2 gi_116256445
Residue:
766
  
Inhibitor
Name:
BDBM57344
Synonyms:
4-(3-bromophenyl)-2-(4-bromophenyl)-7-methyl-2H-pyrazolo[3,4-d]pyridazine 4-(3-bromophenyl)-2-(4-bromophenyl)-7-methylpyrazolo[3,4-d]pyridazine SMR000164075 | cid_1214668
Type:
Small organic molecule
Emp. Form.:
C18H12Br2N4
Mol. Mass.:
444.123
SMILES:
Cc1nnc(-c2cccc(Br)c2)c2cn(nc12)-c1ccc(Br)cc1
: