Target
Isoform 2 of Nuclear receptor corepressor 2 (TRAC-1)
Ligand
BDBM41094
Substrate
Meas. Tech.
Counterscreen for NR2E3 inverse agonists
IC50
4122±n/a nM
Citation
 PubChem, PC Counterscreen for NR2E3 inverse agonists: TR-FRET-based biochemical high throughput dose response assay to identify inverse agonists of the interaction between peroxisome proliferator-activated receptor gamma (PPARg) and nuclear receptor co-repressor 2 (NCOR2) PubChem Bioassay (2010)[AID] 
Target
Name:
Isoform 2 of Nuclear receptor corepressor 2 (TRAC-1)
Synonyms:
CTG26 NCOR2_HUMAN nuclear receptor corepressor 2 isoform 2
Type:
Enzyme Catalytic Domain
Mol. Mass.:
81401.89
Organism:
Homo sapiens (Human)
Description:
Q9Y618-2 gi_116256445
Residue:
766
  
Inhibitor
Name:
BDBM41094
Synonyms:
1-(9H-fluoren-2-yl)-2-[(4-methyl-5-phenyl-1,2,4-triazol-3-yl)sulfanyl]ethanone 1-(9H-fluoren-2-yl)-2-[(4-methyl-5-phenyl-4H-1,2,4-triazol-3-yl)thio]ethanone SMR000195269 | cid_1339742
Type:
Small organic molecule
Emp. Form.:
C24H19N3OS
Mol. Mass.:
397.492
SMILES:
Cn1c(SCC(=O)c2ccc-3c(Cc4ccccc-34)c2)nnc1-c1ccccc1
: