Target
Isoform 2 of Nuclear receptor corepressor 2 (TRAC-1)
Ligand
BDBM48816
Substrate
Meas. Tech.
Counterscreen for NR2E3 inverse agonists
IC50
3792±n/a nM
Citation
 PubChem, PC Counterscreen for NR2E3 inverse agonists: TR-FRET-based biochemical high throughput dose response assay to identify inverse agonists of the interaction between peroxisome proliferator-activated receptor gamma (PPARg) and nuclear receptor co-repressor 2 (NCOR2) PubChem Bioassay (2010)[AID] 
Target
Name:
Isoform 2 of Nuclear receptor corepressor 2 (TRAC-1)
Synonyms:
CTG26 NCOR2_HUMAN nuclear receptor corepressor 2 isoform 2
Type:
Enzyme Catalytic Domain
Mol. Mass.:
81401.89
Organism:
Homo sapiens (Human)
Description:
Q9Y618-2 gi_116256445
Residue:
766
  
Inhibitor
Name:
BDBM48816
Synonyms:
MLS000334839 N-[5-[(4-cyanophenyl)methylsulfanyl]-1,3,4-thiadiazol-2-yl]-1,3-benzothiazole-6-carboxamide SMR000249597 | cid_2452051
Type:
Small organic molecule
Emp. Form.:
C18H11N5OS3
Mol. Mass.:
409.508
SMILES:
O=C(Nc1nnc(SCc2ccc(cc2)C#N)s1)c1ccc2ncsc2c1
: