Target
Isoform 2 of Nuclear receptor corepressor 2 (TRAC-1)
Ligand
BDBM76030
Substrate
Meas. Tech.
Counterscreen for NR2E3 inverse agonists
IC50
4393±n/a nM
Citation
 PubChem, PC Counterscreen for NR2E3 inverse agonists: TR-FRET-based biochemical high throughput dose response assay to identify inverse agonists of the interaction between peroxisome proliferator-activated receptor gamma (PPARg) and nuclear receptor co-repressor 2 (NCOR2) PubChem Bioassay (2010)[AID] 
Target
Name:
Isoform 2 of Nuclear receptor corepressor 2 (TRAC-1)
Synonyms:
CTG26 NCOR2_HUMAN nuclear receptor corepressor 2 isoform 2
Type:
Enzyme Catalytic Domain
Mol. Mass.:
81401.89
Organism:
Homo sapiens (Human)
Description:
Q9Y618-2 gi_116256445
Residue:
766
  
Inhibitor
Name:
BDBM76030
Synonyms:
4-[(2-cyano-1-oxoethyl)amino]benzoic acid [2-oxo-2-(3-oxo-4H-1,4-benzoxazin-6-yl)ethyl] ester MLS002180625 [2-oxidanylidene-2-(3-oxidanylidene-4H-1,4-benzoxazin-6-yl)ethyl] 4-(2-cyanoethanoylamino)benzoate cid_40111582
Type:
Small organic molecule
Emp. Form.:
C20H15N3O6
Mol. Mass.:
393.3496
SMILES:
O=C(CC#N)Nc1ccc(cc1)C(=O)OCC(=O)c1ccc2OCC(=O)Nc2c1
: