Target
Cannabinoid receptor 2
Ligand
BDBM61397
Substrate
Meas. Tech.
SAR analysis of agonists of the Cannabinoid Receptor 2 using an Image-Based Assay - Set 3
EC50
>32000±n/a nM
Citation
 PubChem, PC SAR analysis of agonists of the Cannabinoid Receptor 2 using an Image-Based Assay - Set 3 PubChem Bioassay (2010)[AID] 
Target
Name:
Cannabinoid receptor 2
Synonyms:
CANNABINOID CB2 CB2 CB2B CNR2_HUMAN Cannabinoid CB2 receptor Cannabinoid receptor 2 (CB2R) | hCB2
Type:
G Protein-Coupled Receptor (GPCR)
Mol. Mass.:
39690.94
Organism:
Homo sapiens (Human)
Description:
P34972
Residue:
360
  
Inhibitor
Name:
BDBM61397
Synonyms:
1-Benzyl-2-imino-10-oxo-1,10-dihydro-2H-1,9,10a-triaza-anthracene-3-carboxylic acid ethyl ester 2-imino-5-oxo-1-(phenylmethyl)-3-dipyrido[1,2-d:3',4'-f]pyrimidinecarboxylic acid ethyl ester SMR000013107 ethyl 1-benzyl-2-imino-5-oxodipyrido[1,2-d:3',4'-f]pyrimidine-3-carboxylate | ethyl 2-azanylidene-5-oxidanylidene-1-(phenylmethyl)dipyrido[1,2-d:3',4'-f]pyrimidine-3-carboxylate
Type:
Small organic molecule
Emp. Form.:
C21H18N4O3
Mol. Mass.:
374.3926
SMILES:
CCOC(=O)c1cc2c(nc3ccccn3c2=O)n(Cc2ccccc2)c1=N
: