Target
Cannabinoid receptor 2
Ligand
BDBM76058
Substrate
Meas. Tech.
SAR analysis of antagonists of the Cannabinoid Receptor 2 using an Image-Based Assay - Set 3
IC50
>32000±n/a nM
Citation
 PubChem, PC SAR analysis of antagonists of the Cannabinoid Receptor 2 using an Image-Based Assay - Set 3 PubChem Bioassay (2010)[AID] 
Target
Name:
Cannabinoid receptor 2
Synonyms:
CANNABINOID CB2 CB2 CB2B CNR2_HUMAN Cannabinoid CB2 receptor Cannabinoid receptor 2 (CB2R) | hCB2
Type:
G Protein-Coupled Receptor (GPCR)
Mol. Mass.:
39690.94
Organism:
Homo sapiens (Human)
Description:
P34972
Residue:
360
  
Inhibitor
Name:
BDBM76058
Synonyms:
3-[1-[1-(4-methoxyphenyl)cyclopropanecarbonyl]-4-piperidyl]-5-phenyl-1,3,4-oxadiazol-2-one 3-[1-[1-(4-methoxyphenyl)cyclopropyl]carbonylpiperidin-4-yl]-5-phenyl-1,3,4-oxadiazol-2-one MLS-0367705.0001 | cid_23612550
Type:
Small organic molecule
Emp. Form.:
C24H25N3O4
Mol. Mass.:
419.473
SMILES:
COc1ccc(cc1)C1(CC1)C(=O)N1CCC(CC1)n1nc(oc1=O)-c1ccccc1
: