Target
Cannabinoid receptor 2
Ligand
BDBM76059
Substrate
Meas. Tech.
SAR analysis of antagonists of the Cannabinoid Receptor 2 using an Image-Based Assay - Set 3
IC50
>32000±n/a nM
Citation
 PubChem, PC SAR analysis of antagonists of the Cannabinoid Receptor 2 using an Image-Based Assay - Set 3 PubChem Bioassay (2010)[AID] 
Target
Name:
Cannabinoid receptor 2
Synonyms:
CANNABINOID CB2 CB2 CB2B CNR2_HUMAN Cannabinoid CB2 receptor Cannabinoid receptor 2 (CB2R) | hCB2
Type:
G Protein-Coupled Receptor (GPCR)
Mol. Mass.:
39690.94
Organism:
Homo sapiens (Human)
Description:
P34972
Residue:
360
  
Inhibitor
Name:
BDBM76059
Synonyms:
3-[1-[2-(4-ethoxyphenyl)-1-oxoethyl]-4-piperidinyl]-5-phenyl-1,3,4-oxadiazol-2-one 3-[1-[2-(4-ethoxyphenyl)ethanoyl]piperidin-4-yl]-5-phenyl-1,3,4-oxadiazol-2-one MLS-0437154.0001 | cid_23612553
Type:
Small organic molecule
Emp. Form.:
C23H25N3O4
Mol. Mass.:
407.4623
SMILES:
CCOc1ccc(CC(=O)N2CCC(CC2)n2nc(oc2=O)-c2ccccc2)cc1
: