Target
Cannabinoid receptor 2
Ligand
BDBM76065
Substrate
Meas. Tech.
SAR analysis of antagonists of the Cannabinoid Receptor 2 using an Image-Based Assay - Set 3
IC50
2090±n/a nM
Citation
 PubChem, PC SAR analysis of antagonists of the Cannabinoid Receptor 2 using an Image-Based Assay - Set 3 PubChem Bioassay (2010)[AID] 
Target
Name:
Cannabinoid receptor 2
Synonyms:
CANNABINOID CB2 CB2 CB2B CNR2_HUMAN Cannabinoid CB2 receptor Cannabinoid receptor 2 (CB2R) | hCB2
Type:
G Protein-Coupled Receptor (GPCR)
Mol. Mass.:
39690.94
Organism:
Homo sapiens (Human)
Description:
P34972
Residue:
360
  
Inhibitor
Name:
BDBM76065
Synonyms:
2-(4-methoxyphenyl)-7-methyl-4-(4-phenylphenyl)pyrazolo[3,4-d]pyridazine cid_1214658
Type:
Small organic molecule
Emp. Form.:
C25H20N4O
Mol. Mass.:
392.4525
SMILES:
COc1ccc(cc1)-n1cc2c(nnc(C)c2n1)-c1ccc(cc1)-c1ccccc1
: