Target
Cannabinoid receptor 2
Ligand
BDBM76073
Substrate
Meas. Tech.
SAR analysis of antagonists of the Cannabinoid Receptor 2 using an Image-Based Assay - Set 3
IC50
>32000±n/a nM
Citation
 PubChem, PC SAR analysis of antagonists of the Cannabinoid Receptor 2 using an Image-Based Assay - Set 3 PubChem Bioassay (2010)[AID] 
Target
Name:
Cannabinoid receptor 2
Synonyms:
CANNABINOID CB2 CB2 CB2B CNR2_HUMAN Cannabinoid CB2 receptor Cannabinoid receptor 2 (CB2R) | hCB2
Type:
G Protein-Coupled Receptor (GPCR)
Mol. Mass.:
39690.94
Organism:
Homo sapiens (Human)
Description:
P34972
Residue:
360
  
Inhibitor
Name:
BDBM76073
Synonyms:
2-phenyl-N-[4-(1,3-thiazol-2-ylsulfamoyl)phenyl]quinoline-4-carboxamide 2-phenyl-N-[4-(thiazol-2-ylsulfamoyl)phenyl]cinchoninamide cid_1582687
Type:
Small organic molecule
Emp. Form.:
C25H18N4O3S2
Mol. Mass.:
486.565
SMILES:
O=C(Nc1ccc(cc1)S(=O)(=O)Nc1nccs1)c1cc(nc2ccccc12)-c1ccccc1
: