Target
Cannabinoid receptor 2
Ligand
BDBM76083
Substrate
Meas. Tech.
SAR analysis of antagonists of the Cannabinoid Receptor 2 using an Image-Based Assay - Set 3
IC50
29100±n/a nM
Citation
 PubChem, PC SAR analysis of antagonists of the Cannabinoid Receptor 2 using an Image-Based Assay - Set 3 PubChem Bioassay (2010)[AID] 
Target
Name:
Cannabinoid receptor 2
Synonyms:
CANNABINOID CB2 CB2 CB2B CNR2_HUMAN Cannabinoid CB2 receptor Cannabinoid receptor 2 (CB2R) | hCB2
Type:
G Protein-Coupled Receptor (GPCR)
Mol. Mass.:
39690.94
Organism:
Homo sapiens (Human)
Description:
P34972
Residue:
360
  
Inhibitor
Name:
BDBM76083
Synonyms:
(6Z)-6-[4-(4-chlorophenyl)-5-methyl-1,2-dihydropyrazol-3-ylidene]-3-(2-morpholin-4-ylethoxy)cyclohexa-2,4-dien-1-one (6Z)-6-[4-(4-chlorophenyl)-5-methyl-3-pyrazolin-3-ylidene]-3-(2-morpholinoethoxy)cyclohexa-2,4-dien-1-one cid_17584942
Type:
Small organic molecule
Emp. Form.:
C22H24ClN3O3
Mol. Mass.:
413.897
SMILES:
Cc1[nH]nc(c1-c1ccc(Cl)cc1)-c1ccc(OCCN2CCOCC2)cc1O
: