Target
Cannabinoid receptor 1
Ligand
BDBM76043
Substrate
Meas. Tech.
SAR analysis of agonists of the Cannabinoid Receptor 1 using an Image-Based Assay - Set 4
EC50
>32000±n/a nM
Citation
 PubChem, PC SAR analysis of agonists of the Cannabinoid Receptor 1 using an Image-Based Assay - Set 4 PubChem Bioassay (2010)[AID] 
Target
Name:
Cannabinoid receptor 1
Synonyms:
CANN6 CB-R CNR CNR1_HUMAN Cannabinoid receptor Cannabinoid receptor 1 (brain)
Type:
G Protein-Coupled Receptor (GPCR)
Mol. Mass.:
52868.96
Organism:
Homo sapiens (Human)
Description:
P21554
Residue:
472
  
Inhibitor
Name:
BDBM76043
Synonyms:
1-cyclopentyl-2-imino-5-keto-N-methyl-dipyrido[1,2-d:3',4'-f]pyrimidine-3-carboxamide 1-cyclopentyl-2-imino-N-methyl-5-oxodipyrido[1,2-d:3',4'-f]pyrimidine-3-carboxamide MLS-0437141.0001 | cid_706463
Type:
Small organic molecule
Emp. Form.:
C18H19N5O2
Mol. Mass.:
337.3758
SMILES:
CNC(=O)c1cc2c(nc3ccccn3c2=O)n(C2CCCC2)c1=N
: