Target
Cannabinoid receptor 1
Ligand
BDBM76055
Substrate
Meas. Tech.
SAR analysis of agonists of the Cannabinoid Receptor 1 using an Image-Based Assay - Set 4
EC50
>32000±n/a nM
Citation
 PubChem, PC SAR analysis of agonists of the Cannabinoid Receptor 1 using an Image-Based Assay - Set 4 PubChem Bioassay (2010)[AID] 
Target
Name:
Cannabinoid receptor 1
Synonyms:
CANN6 CB-R CNR CNR1_HUMAN Cannabinoid receptor Cannabinoid receptor 1 (brain)
Type:
G Protein-Coupled Receptor (GPCR)
Mol. Mass.:
52868.96
Organism:
Homo sapiens (Human)
Description:
P21554
Residue:
472
  
Inhibitor
Name:
BDBM76055
Synonyms:
3-[1-[oxo-(1-phenylcyclopentyl)methyl]-4-piperidinyl]-5-phenyl-1,3,4-oxadiazol-2-one 5-phenyl-3-[1-(1-phenylcyclopentanecarbonyl)piperidin-4-yl]-1,3,4-oxadiazol-2-one MLS-0437151.0001 | cid_23612543
Type:
Small organic molecule
Emp. Form.:
C25H27N3O3
Mol. Mass.:
417.5002
SMILES:
O=C(N1CCC(CC1)n1nc(oc1=O)-c1ccccc1)C1(CCCC1)c1ccccc1
: