Target
Cannabinoid receptor 1
Ligand
BDBM76069
Substrate
Meas. Tech.
SAR analysis of agonists of the Cannabinoid Receptor 1 using an Image-Based Assay - Set 4
EC50
>32000±n/a nM
Citation
 PubChem, PC SAR analysis of agonists of the Cannabinoid Receptor 1 using an Image-Based Assay - Set 4 PubChem Bioassay (2010)[AID] 
Target
Name:
Cannabinoid receptor 1
Synonyms:
CANN6 CB-R CNR CNR1_HUMAN Cannabinoid receptor Cannabinoid receptor 1 (brain)
Type:
G Protein-Coupled Receptor (GPCR)
Mol. Mass.:
52868.96
Organism:
Homo sapiens (Human)
Description:
P21554
Residue:
472
  
Inhibitor
Name:
BDBM76069
Synonyms:
2-(4-chlorophenyl)-4-(4-methoxyphenyl)-7-methyl-pyrazolo[3,4-d]pyridazine MLS-0437173.0001 | cid_3392313
Type:
Small organic molecule
Emp. Form.:
C19H15ClN4O
Mol. Mass.:
350.802
SMILES:
COc1ccc(cc1)-c1nnc(C)c2nn(cc12)-c1ccc(Cl)cc1
: