Target
Cannabinoid receptor 1
Ligand
BDBM76071
Substrate
Meas. Tech.
SAR analysis of agonists of the Cannabinoid Receptor 1 using an Image-Based Assay - Set 4
EC50
>32000±n/a nM
Citation
 PubChem, PC SAR analysis of agonists of the Cannabinoid Receptor 1 using an Image-Based Assay - Set 4 PubChem Bioassay (2010)[AID] 
Target
Name:
Cannabinoid receptor 1
Synonyms:
CANN6 CB-R CNR CNR1_HUMAN Cannabinoid receptor Cannabinoid receptor 1 (brain)
Type:
G Protein-Coupled Receptor (GPCR)
Mol. Mass.:
52868.96
Organism:
Homo sapiens (Human)
Description:
P21554
Residue:
472
  
Inhibitor
Name:
BDBM76071
Synonyms:
7-methyl-2,4-bis(4-methylphenyl)pyrazolo[3,4-d]pyridazine MLS-0437175.0001 | cid_45917986
Type:
Small organic molecule
Emp. Form.:
C20H18N4
Mol. Mass.:
314.3837
SMILES:
Cc1ccc(cc1)-c1nnc(C)c2nn(cc12)-c1ccc(C)cc1
: