Target
G-protein coupled receptor 35
Ligand
BDBM76051
Substrate
Meas. Tech.
SAR analysis of Antagonists of the GPR35 Receptor using an Image-Based Assay - Set 6
IC50
>32000±n/a nM
Citation
 PubChem, PC SAR analysis of Antagonists of the GPR35 Receptor using an Image-Based Assay - Set 6 PubChem Bioassay (2010)[AID] 
Target
Name:
G-protein coupled receptor 35
Synonyms:
G protein-coupled receptor 35 GPR35_HUMAN
Type:
Enzyme Catalytic Domain
Mol. Mass.:
34085.57
Organism:
Homo sapiens (Human)
Description:
gi_33695097
Residue:
309
  
Inhibitor
Name:
BDBM76051
Synonyms:
2-azanylidene-N,1-dicyclopentyl-8-methyl-5-oxidanylidene-dipyrido[1,2-d:3',4'-f]pyrimidine-3-carboxamide N,1-dicyclopentyl-2-imino-5-keto-8-methyl-dipyrido[1,2-d:3',4'-f]pyrimidine-3-carboxamide N,1-dicyclopentyl-2-imino-8-methyl-5-oxodipyrido[1,2-d:3',4'-f]pyrimidine-3-carboxamide | cid_3151387
Type:
Small organic molecule
Emp. Form.:
C23H27N5O2
Mol. Mass.:
405.4928
SMILES:
Cc1ccc2nc3n(C4CCCC4)c(=N)c(cc3c(=O)n2c1)C(=O)NC1CCCC1
: