Target
G-protein coupled receptor 35
Ligand
BDBM76071
Substrate
Meas. Tech.
SAR analysis of Antagonists of the GPR35 Receptor using an Image-Based Assay - Set 6
IC50
15400±n/a nM
Citation
 PubChem, PC SAR analysis of Antagonists of the GPR35 Receptor using an Image-Based Assay - Set 6 PubChem Bioassay (2010)[AID] 
Target
Name:
G-protein coupled receptor 35
Synonyms:
G protein-coupled receptor 35 GPR35_HUMAN
Type:
Enzyme Catalytic Domain
Mol. Mass.:
34085.57
Organism:
Homo sapiens (Human)
Description:
gi_33695097
Residue:
309
  
Inhibitor
Name:
BDBM76071
Synonyms:
7-methyl-2,4-bis(4-methylphenyl)pyrazolo[3,4-d]pyridazine MLS-0437175.0001 | cid_45917986
Type:
Small organic molecule
Emp. Form.:
C20H18N4
Mol. Mass.:
314.3837
SMILES:
Cc1ccc(cc1)-c1nnc(C)c2nn(cc12)-c1ccc(C)cc1
: