Target
G-protein coupled receptor 35
Ligand
BDBM76089
Substrate
Meas. Tech.
SAR analysis of Antagonists of the GPR35 Receptor using an Image-Based Assay - Set 6
IC50
>32000±n/a nM
Citation
 PubChem, PC SAR analysis of Antagonists of the GPR35 Receptor using an Image-Based Assay - Set 6 PubChem Bioassay (2010)[AID] 
Target
Name:
G-protein coupled receptor 35
Synonyms:
G protein-coupled receptor 35 GPR35_HUMAN
Type:
Enzyme Catalytic Domain
Mol. Mass.:
34085.57
Organism:
Homo sapiens (Human)
Description:
gi_33695097
Residue:
309
  
Inhibitor
Name:
BDBM76089
Synonyms:
MLS-0437224.0001 [4-(2-methyl-5,6,7,8-tetrahydro-[1]benzothiolo[2,3-d]pyrimidin-4-yl)piperazin-1-yl]-(oxolan-2-yl)methanone cid_4877555
Type:
Small organic molecule
Emp. Form.:
C20H26N4O2S
Mol. Mass.:
386.511
SMILES:
Cc1nc(N2CCN(CC2)C(=O)C2CCCO2)c2c3CCCCc3sc2n1
: