Target
Cannabinoid receptor 1
Ligand
BDBM76036
Substrate
Meas. Tech.
SAR analysis of antagonists of the Cannabinoid Receptor 1 using an Image-Based Assay - Set 4
IC50
17900±n/a nM
Citation
 PubChem, PC SAR analysis of antagonists of the Cannabinoid Receptor 1 using an Image-Based Assay - Set 4 PubChem Bioassay (2010)[AID] 
Target
Name:
Cannabinoid receptor 1
Synonyms:
CANN6 CB-R CNR CNR1_HUMAN Cannabinoid receptor Cannabinoid receptor 1 (brain)
Type:
G Protein-Coupled Receptor (GPCR)
Mol. Mass.:
52868.96
Organism:
Homo sapiens (Human)
Description:
P21554
Residue:
472
  
Inhibitor
Name:
BDBM76036
Synonyms:
MLS-0437135.0001 cyclopropyl-[4-(2,7-dimethyl-5,6,7,8-tetrahydro-[1]benzothiolo[2,3-d]pyrimidin-4-yl)-1-piperazinyl]methanone cyclopropyl-[4-(2,7-dimethyl-5,6,7,8-tetrahydrobenzothiopheno[2,3-d]pyrimidin-4-yl)piperazino]methanone
Type:
Small organic molecule
Emp. Form.:
C20H26N4OS
Mol. Mass.:
370.512
SMILES:
CC1CCc2c(C1)sc1nc(C)nc(N3CCN(CC3)C(=O)C3CC3)c21
: