Target
Cannabinoid receptor 1
Ligand
BDBM76068
Substrate
Meas. Tech.
SAR analysis of antagonists of the Cannabinoid Receptor 1 using an Image-Based Assay - Set 4
IC50
4610±n/a nM
Citation
 PubChem, PC SAR analysis of antagonists of the Cannabinoid Receptor 1 using an Image-Based Assay - Set 4 PubChem Bioassay (2010)[AID] 
Target
Name:
Cannabinoid receptor 1
Synonyms:
CANN6 CB-R CNR CNR1_HUMAN Cannabinoid receptor Cannabinoid receptor 1 (brain)
Type:
G Protein-Coupled Receptor (GPCR)
Mol. Mass.:
52868.96
Organism:
Homo sapiens (Human)
Description:
P21554
Residue:
472
  
Inhibitor
Name:
BDBM76068
Synonyms:
7-methyl-2-phenyl-4-(p-tolyl)pyrazolo[3,4-d]pyridazine 7-methyl-4-(4-methylphenyl)-2-phenylpyrazolo[3,4-d]pyridazine cid_45917985
Type:
Small organic molecule
Emp. Form.:
C19H16N4
Mol. Mass.:
300.3571
SMILES:
Cc1ccc(cc1)-c1nnc(C)c2nn(cc12)-c1ccccc1
: