Target
Cannabinoid receptor 1
Ligand
BDBM76088
Substrate
Meas. Tech.
SAR analysis of antagonists of the Cannabinoid Receptor 1 using an Image-Based Assay - Set 4
IC50
16900±n/a nM
Citation
 PubChem, PC SAR analysis of antagonists of the Cannabinoid Receptor 1 using an Image-Based Assay - Set 4 PubChem Bioassay (2010)[AID] 
Target
Name:
Cannabinoid receptor 1
Synonyms:
CANN6 CB-R CNR CNR1_HUMAN Cannabinoid receptor Cannabinoid receptor 1 (brain)
Type:
G Protein-Coupled Receptor (GPCR)
Mol. Mass.:
52868.96
Organism:
Homo sapiens (Human)
Description:
P21554
Residue:
472
  
Inhibitor
Name:
BDBM76088
Synonyms:
MLS-0295640.0001 N-[4-[(3,4-dimethyl-5-isoxazolyl)sulfamoyl]phenyl]-2-(4-methoxyphenyl)-4-quinolinecarboxamide cid_2333197
Type:
Small organic molecule
Emp. Form.:
C28H24N4O5S
Mol. Mass.:
528.579
SMILES:
COc1ccc(cc1)-c1cc(C(=O)Nc2ccc(cc2)S(=O)(=O)Nc2onc(C)c2C)c2ccccc2n1
: