Target
G-protein coupled receptor 35
Ligand
BDBM76039
Substrate
Meas. Tech.
SAR analysis of Agonists of the GPR35 Receptor using an Image-Based Assay - Set 4
EC50
>32000±n/a nM
Citation
 PubChem, PC SAR analysis of Agonists of the GPR35 Receptor using an Image-Based Assay - Set 4 PubChem Bioassay (2010)[AID] 
Target
Name:
G-protein coupled receptor 35
Synonyms:
G protein-coupled receptor 35 GPR35_HUMAN
Type:
Enzyme Catalytic Domain
Mol. Mass.:
34085.57
Organism:
Homo sapiens (Human)
Description:
gi_33695097
Residue:
309
  
Inhibitor
Name:
BDBM76039
Synonyms:
2,3-dihydro-1,4-benzodioxin-6-yl-[4-(2-methyl-5,6,7,8-tetrahydro-[1]benzothiolo[2,3-d]pyrimidin-4-yl)-1-piperazinyl]methanone 2,3-dihydro-1,4-benzodioxin-6-yl-[4-(2-methyl-5,6,7,8-tetrahydrobenzothiopheno[2,3-d]pyrimidin-4-yl)piperazino]methanone cid_1434989
Type:
Small organic molecule
Emp. Form.:
C24H26N4O3S
Mol. Mass.:
450.553
SMILES:
Cc1nc(N2CCN(CC2)C(=O)c2ccc3OCCOc3c2)c2c3CCCCc3sc2n1
: