Target
G-protein coupled receptor 35
Ligand
BDBM76047
Substrate
Meas. Tech.
SAR analysis of Agonists of the GPR35 Receptor using an Image-Based Assay - Set 4
EC50
>32000±n/a nM
Citation
 PubChem, PC SAR analysis of Agonists of the GPR35 Receptor using an Image-Based Assay - Set 4 PubChem Bioassay (2010)[AID] 
Target
Name:
G-protein coupled receptor 35
Synonyms:
G protein-coupled receptor 35 GPR35_HUMAN
Type:
Enzyme Catalytic Domain
Mol. Mass.:
34085.57
Organism:
Homo sapiens (Human)
Description:
gi_33695097
Residue:
309
  
Inhibitor
Name:
BDBM76047
Synonyms:
1-cyclopentyl-2-imino-5-oxo-N-(phenylmethyl)-3-dipyrido[1,2-d:3',4'-f]pyrimidinecarboxamide MLS-0437144.0001 N-benzyl-1-cyclopentyl-2-imino-5-oxodipyrido[1,2-d:3',4'-f]pyrimidine-3-carboxamide | cid_1077539
Type:
Small organic molecule
Emp. Form.:
C24H23N5O2
Mol. Mass.:
413.4717
SMILES:
N=c1c(cc2c(nc3ccccn3c2=O)n1C1CCCC1)C(=O)NCc1ccccc1
: