Target
G-protein coupled receptor 35
Ligand
BDBM76079
Substrate
Meas. Tech.
SAR analysis of Agonists of the GPR35 Receptor using an Image-Based Assay - Set 4
EC50
>32000±n/a nM
Citation
 PubChem, PC SAR analysis of Agonists of the GPR35 Receptor using an Image-Based Assay - Set 4 PubChem Bioassay (2010)[AID] 
Target
Name:
G-protein coupled receptor 35
Synonyms:
G protein-coupled receptor 35 GPR35_HUMAN
Type:
Enzyme Catalytic Domain
Mol. Mass.:
34085.57
Organism:
Homo sapiens (Human)
Description:
gi_33695097
Residue:
309
  
Inhibitor
Name:
BDBM76079
Synonyms:
6-methyl-N-(4-morpholin-4-ylsulfonylphenyl)-2-pyridin-2-yl-quinoline-4-carboxamide 6-methyl-N-(4-morpholinosulfonylphenyl)-2-(2-pyridyl)cinchoninamide MLS-0269956.0001 | cid_1261894
Type:
Small organic molecule
Emp. Form.:
C26H24N4O4S
Mol. Mass.:
488.558
SMILES:
Cc1ccc2nc(cc(C(=O)Nc3ccc(cc3)S(=O)(=O)N3CCOCC3)c2c1)-c1ccccn1
: